Target
Elongin-C
Ligand
BDBM50459879
Substrate
Meas. Tech.
ChEMBL_1767416 (CHEMBL4219528)
Kd
73±n/a nM
Citation
 Chan, KHZengerle, MTesta, ACiulli, A Impact of Target Warhead and Linkage Vector on Inducing Protein Degradation: Comparison of Bromodomain and Extra-Terminal (BET) Degraders Derived from Triazolodiazepine (JQ1) and Tetrahydroquinoline (I-BET726) BET Inhibitor Scaffolds. J Med Chem 61:504-513 (2018)  
Target
Name:
Elongin-C
Synonyms:
ELOC Elongin 15 kDa subunit RNA polymerase II transcription factor SIII subunit C TCEB1 | Transcription elongation factor B polypeptide 1
Type:
PROTEIN
Mol. Mass.:
12466.49
Organism:
Homo sapiens (Human)
Description:
ChEMBL_108414
Residue:
112
  
Inhibitor
Name:
BDBM50459879
Synonyms:
CHEMBL4227226
Type:
Small organic molecule
Emp. Form.:
C51H64ClN9O9S2
Mol. Mass.:
1046.692
SMILES:
Cc1ncsc1-c1ccc(CNC(=O)[C@@H]2C[C@@H](O)CN2C(=O)[C@@H](NC(=O)COCCOCCOCCOCCNC(=O)C[C@@H]2N=C(c3c(C)c(C)sc3-n3c(C)nnc23)c2ccc(Cl)cc2)C(C)(C)C)cc1
: