Target
Elongin-C
Ligand
BDBM50459881
Substrate
Meas. Tech.
ChEMBL_1767416 (CHEMBL4219528)
Kd
109±n/a nM
Citation
 Chan, KHZengerle, MTesta, ACiulli, A Impact of Target Warhead and Linkage Vector on Inducing Protein Degradation: Comparison of Bromodomain and Extra-Terminal (BET) Degraders Derived from Triazolodiazepine (JQ1) and Tetrahydroquinoline (I-BET726) BET Inhibitor Scaffolds. J Med Chem 61:504-513 (2018)  
Target
Name:
Elongin-C
Synonyms:
ELOC Elongin 15 kDa subunit RNA polymerase II transcription factor SIII subunit C TCEB1 | Transcription elongation factor B polypeptide 1
Type:
PROTEIN
Mol. Mass.:
12466.49
Organism:
Homo sapiens (Human)
Description:
ChEMBL_108414
Residue:
112
  
Inhibitor
Name:
BDBM50459881
Synonyms:
CHEMBL4226376
Type:
Small organic molecule
Emp. Form.:
C57H70ClN7O10S
Mol. Mass.:
1080.725
SMILES:
C[C@H]1C[C@@H](Nc2ccc(Cl)cc2)c2cc(ccc2N1C(C)=O)-c1ccc(cc1)C(=O)NCCOCCOCCOCCOCC(=O)N[C@H](C(=O)N1C[C@H](O)C[C@H]1C(=O)NCc1ccc(cc1)-c1scnc1C)C(C)(C)C
: