Target
Elongin-C
Ligand
BDBM50459961
Substrate
Meas. Tech.
ChEMBL_1767769 (CHEMBL4219881)
Kd
320±n/a nM
Citation
 Soares, PGadd, MSFrost, JGaldeano, CEllis, LEpemolu, ORocha, SRead, KDCiulli, A Group-Based Optimization of Potent and Cell-Active Inhibitors of the von Hippel-Lindau (VHL) E3 Ubiquitin Ligase: Structure-Activity Relationships Leading to the Chemical Probe (2S,4R)-1-((S)-2-(1-Cyanocyclopropanecarboxamido)-3,3-dimethylbutanoyl)-4-hydroxy-N-(4-(4-methylthiazol-5-yl)benzyl)pyrroli J Med Chem 61:599-618 (2018)  
Target
Name:
Elongin-C
Synonyms:
ELOC Elongin 15 kDa subunit RNA polymerase II transcription factor SIII subunit C TCEB1 | Transcription elongation factor B polypeptide 1
Type:
PROTEIN
Mol. Mass.:
12466.49
Organism:
Homo sapiens (Human)
Description:
ChEMBL_108414
Residue:
112
  
Inhibitor
Name:
BDBM50459961
Synonyms:
CHEMBL4225714
Type:
Small organic molecule
Emp. Form.:
C26H34N4O5S
Mol. Mass.:
514.637
SMILES:
Cc1ncsc1-c1ccc(CNC(=O)[C@@H]2C[C@@H](O)CN2C(=O)[C@@H](NC(=O)C2COC2)C(C)(C)C)cc1
: