Target
Renin
Ligand
BDBM50022969
Substrate
Meas. Tech.
ChEBML_154903
IC50
>1000000±n/a nM
Citation
 Hui, KYCarlson, WDBernatowicz, MSHaber, E Analysis of structure-activity relationships in renin substrate analogue inhibitory peptides. J Med Chem 30:1287-95 (1987)  
Target
Name:
Renin
Synonyms:
Angiotensinogenase RENI_HUMAN
Type:
Enzyme
Mol. Mass.:
45058.99
Organism:
Homo sapiens (Human)
Description:
Residue:
406
  
Inhibitor
Name:
BDBM50022969
Synonyms:
CHEMBL2371836 | Pro-His-Pro-Phe-His-5-amino-valeric acid-Ile-Phe-NH2
Type:
Small organic molecule
Emp. Form.:
C51H69N13O8
Mol. Mass.:
992.1759
SMILES:
CCC[C@H](NC(=O)[C@H](Cc1c[nH]cn1)NC(=O)[C@H](Cc1ccccc1)NC(=O)[C@@H]1CCCN1C(=O)[C@H](Cc1c[nH]cn1)NC(=O)[C@@H]1CCCN1)C(=O)N[C@@H]([C@@H](C)CC)C(=O)NC(=O)[C@@H](N)Cc1ccccc1
: