Target
Histone deacetylase 1/REST corepressor 3
Ligand
BDBM50460386
Substrate
Meas. Tech.
ChEMBL_1769411 (CHEMBL4221523)
Ki
43±n/a nM
Citation
 Milelli, AMarchetti, CTurrini, ECatanzaro, EMazzone, RTomaselli, DFimognari, CTumiatti, VMinarini, A Novel polyamine-based Histone deacetylases-Lysine demethylase 1 dual binding inhibitors. Bioorg Med Chem Lett 28:1001-1004 (2018)  
Target
Name:
Histone deacetylase 1/REST corepressor 3
Synonyms:
HDAC1/REST corepressor 3
Type:
Mol. Mass.:
Description:
ASSAY_ID of ChEMBL is 1769411
Components:
This complex has 2 components.
Component 1
Name:
Histone deacetylase 1
Synonyms:
Cereblon/Histone deacetylase 1 HDAC1 Histone deacetylase 1 (HDAC1) RPD3L1
Type:
Enzyme
Mol. Mass.:
55090.27
Organism:
Homo sapiens (Human)
Description:
Q13547
Residue:
482
  
Component 2
Name:
REST corepressor 3
Synonyms:
KIAA1343 RCOR3_HUMAN | REST corepressor 3
Type:
PROTEIN
Mol. Mass.:
55589.31
Organism:
Homo sapiens
Description:
ChEMBL_118345
Residue:
495
  
Inhibitor
Name:
BDBM50460386
Synonyms:
CHEMBL4228166
Type:
Small organic molecule
Emp. Form.:
C38H61Cl3N8O6
Mol. Mass.:
832.3
SMILES:
Cl.Cl.Cl.N[C@@H]1C[C@H]1c1ccc(NC(=O)CCC(=O)NCCCNCCCCNCCCNC(=O)c2ccc(NC(=O)CCCCCCC(=O)NO)cc2)cc1
: