Target
Tissue-type plasminogen activator
Ligand
BDBM50460457
Substrate
Meas. Tech.
ChEBML_1769528
Ki
10100±n/a nM
Citation
 Hu, ZWang, CHan, WRossi, KABozarth, JMWu, YSheriff, SMyers, JELuettgen, JMSeiffert, DAWexler, RRQuan, ML Pyridazine and pyridazinone derivatives as potent and selective factor XIa inhibitors. Bioorg Med Chem Lett 28:987-992 (2018)  
Target
Name:
Tissue-type plasminogen activator
Synonyms:
Alteplase Reteplase Thrombin receptor protein Tissue-type plasminogen activator (tPA) t-PA t-plasminogen activator
Type:
Enzyme
Mol. Mass.:
62931.08
Organism:
Homo sapiens (Human)
Description:
Residue:
562
  
Inhibitor
Name:
BDBM50460457
Synonyms:
CHEMBL4227743
Type:
Small organic molecule
Emp. Form.:
C30H24Cl2N8O3
Mol. Mass.:
615.469
SMILES:
COC(=O)Nc1ccc(cc1)-c1cc(nnc1Cl)[C@H](Cc1ccccc1)NC(=O)\C=C\c1cc(Cl)ccc1-n1cnnn1
: