Target
Falcipain 2
Ligand
BDBM50461232
Substrate
Meas. Tech.
ChEMBL_1770953 (CHEMBL4223065)
IC50
26900±n/a nM
Citation
 Himangini, naPathak, DPSharma, VKumar, S Designing novel inhibitors against falcipain-2 of Plasmodium falciparum. Bioorg Med Chem Lett 28:1566-1569 (2018)  
Target
Name:
Falcipain 2
Synonyms:
Cysteine protease falcipain-2 Falcipain-2
Type:
Enzyme
Mol. Mass.:
55912.60
Organism:
Plasmodium falciparum
Description:
Recombinant falcipain-2.
Residue:
484
  
Inhibitor
Name:
BDBM50461232
Synonyms:
CHEMBL4227123
Type:
Small organic molecule
Emp. Form.:
C28H26FN3O2
Mol. Mass.:
455.5233
SMILES:
CCN(CC)c1ccc2cc(C3=NN(C(C3)c3ccc(F)cc3)c3ccccc3)c(=O)oc2c1
: