Target
Falcipain-2
Ligand
BDBM50461234
Substrate
Meas. Tech.
ChEMBL_1770954 (CHEMBL4223066)
IC50
1900±n/a nM
Citation
 Himangini, naPathak, DPSharma, VKumar, S Designing novel inhibitors against falcipain-2 of Plasmodium falciparum. Bioorg Med Chem Lett 28:1566-1569 (2018)  
Target
Name:
Falcipain-2
Synonyms:
Type:
Enzyme
Mol. Mass.:
55912.57
Organism:
Plasmodium falciparum
Description:
Residue:
484
  
Inhibitor
Name:
BDBM50461234
Synonyms:
CHEMBL4226443
Type:
Small organic molecule
Emp. Form.:
C29H26FN3O3
Mol. Mass.:
483.5334
SMILES:
CCN(CC)c1ccc2cc(C3=NN(C(C3)c3ccc(F)cc3)C(=O)c3ccccc3)c(=O)oc2c1
: