Target
Elongin-C
Ligand
BDBM50459942
Substrate
Meas. Tech.
ChEMBL_1771486 (CHEMBL4223598)
Kd
690±n/a nM
Citation
 Soares, PLucas, XCiulli, A Thioamide substitution to probe the hydroxyproline recognition of VHL ligands. Bioorg Med Chem 26:2992-2995 (2018)  
Target
Name:
Elongin-C
Synonyms:
ELOC Elongin 15 kDa subunit RNA polymerase II transcription factor SIII subunit C TCEB1 | Transcription elongation factor B polypeptide 1
Type:
PROTEIN
Mol. Mass.:
12466.49
Organism:
Homo sapiens (Human)
Description:
ChEMBL_108414
Residue:
112
  
Inhibitor
Name:
BDBM50459942
Synonyms:
CHEMBL4227864 US11512083, Example 85
Type:
Small organic molecule
Emp. Form.:
C21H26N4O4S
Mol. Mass.:
430.521
SMILES:
C[C@H](NC(C)=O)C(=O)N1C[C@H](O)C[C@H]1C(=O)NCc1ccc(cc1)-c1scnc1C
: