Target
Beta-secretase 1
Ligand
BDBM50432608
Substrate
Meas. Tech.
ChEMBL_1772315 (CHEMBL4224427)
IC50
48±n/a nM
Citation
 Nakahara, KFuchino, KKomano, KAsada, NTadano, GHasegawa, TYamamoto, TSako, YOgawa, MUnemura, CHosono, MIto, HSakaguchi, GAndo, SOhnishi, SKido, YFukushima, TDhuyvetter, DBorghys, HGijsen, HJMYamano, YIso, YKusakabe, KI Discovery of Potent and Centrally Active 6-Substituted 5-Fluoro-1,3-dihydro-oxazine ?-Secretase (BACE1) Inhibitors via Active Conformation Stabilization. J Med Chem 61:5525-5546 (2018)  
Target
Name:
Beta-secretase 1
Synonyms:
ASP2 Aspartyl protease 2 BACE1 Beta-secretase (BACE) Beta-secretase 1 (BACE 1) Beta-secretase 1 (BACE1) Beta-site amyloid precursor protein cleaving enzyme 1 Memapsin-2 beta-Secretase (BACE-1) | beta-Secretase (BACE1)
Type:
Protein
Mol. Mass.:
55755.10
Organism:
Homo sapiens (Human)
Description:
P56817
Residue:
501
  
Inhibitor
Name:
BDBM50432608
Synonyms:
CHEMBL2347204 | US8754075, 4
Type:
Small organic molecule
Emp. Form.:
C18H15F2N5O2
Mol. Mass.:
371.3408
SMILES:
C[C@@]1(N=C(N)OC[C@@H]1F)c1cc(NC(=O)c2ccc(cn2)C#N)ccc1F
: