Target
Acetylcholinesterase
Ligand
BDBM50462580
Substrate
Meas. Tech.
ChEMBL_1775686 (CHEMBL4232678)
Kd
0.000±n/a nM
Citation
 Unver, MYGierse, RMRitchie, HHirsch, AKH Druggability Assessment of Targets Used in Kinetic Target-Guided Synthesis. J Med Chem 61:9395-9409 (2018)  
Target
Name:
Acetylcholinesterase
Synonyms:
ACES_ELEEL Acetylcholinesterase (EeAChE) | ache
Type:
Enzyme
Mol. Mass.:
71812.79
Organism:
Electrophorus electricus (Electric eel)
Description:
Residue:
633
  
Inhibitor
Name:
BDBM50462580
Synonyms:
CHEMBL4239268
Type:
Small organic molecule
Emp. Form.:
C41H43N8
Mol. Mass.:
647.8332
SMILES:
Nc1ccc2c(c1)c(-c1ccccc1)[n+](CCCCCc1cnnn1CCNc1c3CCCCc3nc3ccccc13)c1cc(N)ccc21
: