Target
Mitogen-activated protein kinase kinase kinase 10
Ligand
BDBM50462709
Substrate
Meas. Tech.
ChEMBL_1776367 (CHEMBL4233359)
IC50
>10000±n/a nM
Citation
 Gao, HMarhefka, CJacobs, MDCao, JBandarage, UKGreen, J ROCK inhibitors 2. Improving potency, selectivity and solubility through the application of rationally designed solubilizing groups. Bioorg Med Chem Lett 28:2616-2621 (2018)  
Target
Name:
Mitogen-activated protein kinase kinase kinase 10
Synonyms:
M3K10_HUMAN MLK2 Mitogen-activated protein kinase kinase kinase 10 | Mixed Lineage Kinase 2 (MLK2)
Type:
PROTEIN
Mol. Mass.:
103699.30
Organism:
Homo sapiens (Human)
Description:
ChEMBL_1460564
Residue:
954
  
Inhibitor
Name:
BDBM50462709
Synonyms:
CHEMBL4245507
Type:
Small organic molecule
Emp. Form.:
C23H27N5O2S
Mol. Mass.:
437.558
SMILES:
O=C(Cc1cccc(OCCCN2CCNCC2)c1)Nc1nc(cs1)-c1ccncc1
: