Target
Bile acid receptor
Ligand
BDBM50463011
Substrate
Meas. Tech.
ChEMBL_1777019 (CHEMBL4234011)
IC50
1.3±n/a nM
Citation
 Schmidt, JSchierle, SGellrich, LKaiser, AMerk, D Structural optimization and in vitro profiling of N-phenylbenzamide-based farnesoid X receptor antagonists. Bioorg Med Chem 26:4240-4253 (2018)  
Target
Name:
Bile acid receptor
Synonyms:
BAR FXR HRR1 NR1H4_HUMAN RIP14 Retinoid X receptor-interacting protein 14 | farnesoid x receptor
Type:
Nuclear Receptor
Mol. Mass.:
55916.24
Organism:
Homo sapiens (Human)
Description:
Q96RI1
Residue:
486
  
Inhibitor
Name:
BDBM50463011
Synonyms:
CHEMBL4241985
Type:
Small organic molecule
Emp. Form.:
C20H23NO4
Mol. Mass.:
341.4009
SMILES:
COc1cc(ccc1C(=O)Nc1ccc(CC(O)=O)cc1)C(C)(C)C
: