Target
5'-AMP-activated protein kinase subunit beta-2
Ligand
BDBM50463100
Substrate
Meas. Tech.
ChEMBL_1777629 (CHEMBL4234621)
EC50
>40000±n/a nM
Citation
 Ryder, TFCalabrese, MFWalker, GSCameron, KOReyes, ARBorzilleri, KADelmore, JMiller, RKurumbail, RGWard, JKung, DWBrown, JAEdmonds, DJEng, HWolford, ACKalgutkar, AS Acyl Glucuronide Metabolites of 6-Chloro-5-[4-(1-hydroxycyclobutyl)phenyl]-1 H-indole-3-carboxylic Acid (PF-06409577) and Related Indole-3-carboxylic Acid Derivatives are Direct Activators of Adenosine Monophosphate-Activated Protein Kinase (AMPK). J Med Chem 61:7273-7288 (2018)  
Target
Name:
5'-AMP-activated protein kinase subunit beta-2
Synonyms:
AAKB2_HUMAN AMPK subunit beta-2 | PRKAB2
Type:
PROTEIN
Mol. Mass.:
30301.35
Organism:
Homo sapiens (Human)
Description:
ChEMBL_107883
Residue:
272
  
Inhibitor
Name:
BDBM50463100
Synonyms:
CHEMBL4249790
Type:
Small organic molecule
Emp. Form.:
C25H24ClNO9
Mol. Mass.:
517.912
SMILES:
O[C@@H]1[C@@H](O)[C@H](OC(=O)c2c[nH]c3cc(Cl)c(cc23)-c2ccc(cc2)C2(O)CCC2)O[C@@H]([C@H]1O)C(O)=O
: