Target
Myc proto-oncogene protein
Ligand
BDBM50463140
Substrate
Meas. Tech.
ChEMBL_1777746 (CHEMBL4234738)
IC50
5000±n/a nM
Citation
 Jacob, NTMiranda, POShirey, RJGautam, RZhou, Bde Orbe Izquierdo, MEHixon, MSHart, JRUeno, LVogt, PKJanda, KD Synthetic molecules for disruption of the MYC protein-protein interface. Bioorg Med Chem 26:4234-4239 (2018)  
Target
Name:
Myc proto-oncogene protein
Synonyms:
BHLHE39 MYC Proto-oncogene c-Myc | Transcription factor p64
Type:
PROTEIN
Mol. Mass.:
48794.95
Organism:
Homo sapiens (Human)
Description:
ChEMBL_935266
Residue:
439
  
Inhibitor
Name:
BDBM50463140
Synonyms:
CHEMBL4240109
Type:
Small organic molecule
Emp. Form.:
C22H14N2O
Mol. Mass.:
322.3594
SMILES:
N#Cc1ccc(cc1)-c1cc(cc(n1)-c1ccco1)-c1ccccc1
: