Target
Large neutral amino acids transporter small subunit 1
Ligand
BDBM50463214
Substrate
Meas. Tech.
ChEMBL_1777837 (CHEMBL4234829)
IC50
130000±n/a nM
Citation
 Chien, HCColas, CFinke, KSpringer, SStoner, LZur, AAVenteicher, BCampbell, JHall, CFlint, AAugustyn, EHernandez, CHeeren, NHansen, LAnthony, ABauer, JFotiadis, DSchlessinger, AGiacomini, KMThomas, AA Reevaluating the Substrate Specificity of the L-Type Amino Acid Transporter (LAT1). J Med Chem 61:7358-7373 (2018)  
Target
Name:
Large neutral amino acids transporter small subunit 1
Synonyms:
4F2 LC 4F2LC CD98LC Integral membrane protein E16 LAT1 Large neutral amino acids transporter small subunit 1 SLC7A5 hLAT1 | y+ system cationic amino acid transporter
Type:
PROTEIN
Mol. Mass.:
55013.61
Organism:
Homo sapiens (Human)
Description:
ChEMBL_100160
Residue:
507
  
Inhibitor
Name:
BDBM50463214
Synonyms:
CHEBI:44303 | CHEMBL1232501
Type:
Small organic molecule
Emp. Form.:
C9H11NO3
Mol. Mass.:
181.1885
SMILES:
N[C@@H](Cc1cccc(O)c1)C(O)=O
: