Target
Tyrosyl-DNA phosphodiesterase 1
Ligand
BDBM50463376
Substrate
Meas. Tech.
ChEMBL_1778170 (CHEMBL4235162)
IC50
25±n/a nM
Citation
 Zakharova, OLuzina, OZakharenko, ASokolov, DFilimonov, ADyrkheeva, NChepanova, AIlina, EIlyina, AKlabenkova, KChelobanov, BStetsenko, DZafar, AEurtivong, CReynisson, JVolcho, KSalakhutdinov, NLavrik, O Synthesis and evaluation of aryliden- and hetarylidenfuranone derivatives of usnic acid as highly potent Tdp1 inhibitors. Bioorg Med Chem 26:4470-4480 (2018)  
Target
Name:
Tyrosyl-DNA phosphodiesterase 1
Synonyms:
TDP1 Tyrosyl-DNA phosphodiesterase 1 | Tyrosyl-DNA phosphodiesterase 1 (TDP1)
Type:
Enzyme
Mol. Mass.:
68430.66
Organism:
Homo sapiens (Human)
Description:
Q9NUW8
Residue:
608
  
Inhibitor
Name:
BDBM50463376
Synonyms:
CHEMBL4244758
Type:
Small organic molecule
Emp. Form.:
C33H34O8
Mol. Mass.:
558.6183
SMILES:
CC(=O)C1=C(O)C=C2Oc3c4C(=O)\C(Oc4c(C)c(O)c3[C@@]2(C)C1=O)=C\c1cc(cc(c1O)C(C)(C)C)C(C)(C)C
: