Target
Tyrosine-protein kinase Fer
Ligand
BDBM50463483
Substrate
Meas. Tech.
ChEMBL_1778361 (CHEMBL4235353)
Ki
>2000±n/a nM
Citation
 Bandarage, UKCao, JCome, JHCourt, JJGao, HJacobs, MDMarhefka, CNanthakumar, SGreen, J ROCK inhibitors 3: Design, synthesis and structure-activity relationships of 7-azaindole-based Rho kinase (ROCK) inhibitors. Bioorg Med Chem Lett 28:2622-2626 (2018)  
Target
Name:
Tyrosine-protein kinase Fer
Synonyms:
FER TYK3
Type:
Enzyme
Mol. Mass.:
94643.38
Organism:
Homo sapiens (Human)
Description:
P16591
Residue:
822
  
Inhibitor
Name:
BDBM50463483
Synonyms:
CHEMBL4245242
Type:
Small organic molecule
Emp. Form.:
C26H29N5O2S
Mol. Mass.:
475.606
SMILES:
O=C(Cc1cccc(OCCCC2CCNCC2)c1)Nc1nc(cs1)-c1c[nH]c2ncccc12
: