Target
Phosphorylase b kinase gamma catalytic chain, liver/testis isoform
Ligand
BDBM50463483
Substrate
Meas. Tech.
ChEMBL_1778416 (CHEMBL4235408)
Ki
>2000±n/a nM
Citation
 Bandarage, UKCao, JCome, JHCourt, JJGao, HJacobs, MDMarhefka, CNanthakumar, SGreen, J ROCK inhibitors 3: Design, synthesis and structure-activity relationships of 7-azaindole-based Rho kinase (ROCK) inhibitors. Bioorg Med Chem Lett 28:2622-2626 (2018)  
Target
Name:
Phosphorylase b kinase gamma catalytic chain, liver/testis isoform
Synonyms:
PHKG2 Phosphorylase kinase | Phosphorylase kinase gamma subunit 2
Type:
PROTEIN
Mol. Mass.:
46440.15
Organism:
Homo sapiens (Human)
Description:
ChEMBL_774277
Residue:
406
  
Inhibitor
Name:
BDBM50463483
Synonyms:
CHEMBL4245242
Type:
Small organic molecule
Emp. Form.:
C26H29N5O2S
Mol. Mass.:
475.606
SMILES:
O=C(Cc1cccc(OCCCC2CCNCC2)c1)Nc1nc(cs1)-c1c[nH]c2ncccc12
: