Target
Bone morphogenetic protein receptor type-1B
Ligand
BDBM50463510
Substrate
Meas. Tech.
ChEMBL_1778485 (CHEMBL4235477)
Kd
96±n/a nM
Citation
 Hudson, LMui, JVázquez, SCarvalho, DMWilliams, EJones, CBullock, ANHoelder, S Novel Quinazolinone Inhibitors of ALK2 Flip between Alternate Binding Modes: Structure-Activity Relationship, Structural Characterization, Kinase Profiling, and Cellular Proof of Concept. J Med Chem 61:7261-7272 (2018)  
Target
Name:
Bone morphogenetic protein receptor type-1B
Synonyms:
ALK-6 BMPR1B Bone morphogenetic protein receptor type-1B (BMPR1B)
Type:
Enzyme
Mol. Mass.:
56939.41
Organism:
Homo sapiens (Human)
Description:
O00238
Residue:
502
  
Inhibitor
Name:
BDBM50463510
Synonyms:
CHEMBL4244382
Type:
Small organic molecule
Emp. Form.:
C27H22N4O2
Mol. Mass.:
434.4892
SMILES:
O=c1n(cnc2ccc(cc12)-c1ccnc2ccccc12)-c1ccc(cc1)N1CCOCC1
: