Target
Trifunctional purine biosynthetic protein adenosine-3
Ligand
BDBM50024464
Substrate
Meas. Tech.
ChEBML_70043
Ki
1300±n/a nM
Citation
 Caperelli, CA N10-substituted 5,8-dideazafolate inhibitors of glycinamide ribonucleotide transformylase. J Med Chem 30:1254-6 (1987)  
Target
Name:
Trifunctional purine biosynthetic protein adenosine-3
Synonyms:
GAR transformylase PUR2_MOUSE
Type:
PROTEIN
Mol. Mass.:
107504.27
Organism:
Mus musculus
Description:
ChEMBL_497843
Residue:
1010
  
Inhibitor
Name:
BDBM50024464
Synonyms:
2-{4-[Acetyl-(2-amino-4-oxo-3,4-dihydro-quinazolin-6-ylmethyl)-amino]-benzoylamino}-pentanedioic acid | CHEMBL22344
Type:
Small organic molecule
Emp. Form.:
C23H23N5O7
Mol. Mass.:
481.458
SMILES:
CC(=O)N(Cc1ccc2nc(N)[nH]c(=O)c2c1)c1ccc(cc1)C(=O)NC(CCC(O)=O)C(O)=O
: