Target
Erythropoietin receptor
Ligand
BDBM50463567
Substrate
Meas. Tech.
ChEMBL_1778763 (CHEMBL4235755)
EC50
540±n/a nM
Citation
 Feng, SChang, SYan, LDong, HXu, XWang, CLiang, YLiu, K Design, synthesis, and activity evaluation of novel erythropoietin mimetic peptides. Bioorg Med Chem Lett 28:3038-3041 (2018)  
Target
Name:
Erythropoietin receptor
Synonyms:
EPO-R EPOR_HUMAN
Type:
PROTEIN
Mol. Mass.:
55040.56
Organism:
Homo sapiens (Human)
Description:
ChEMBL_67864
Residue:
508
  
Inhibitor
Name:
BDBM50463567
Synonyms:
CHEMBL4240318
Type:
Small organic molecule
Emp. Form.:
C107H163N29O25S3
Mol. Mass.:
2351.813
SMILES:
CC[C@H](C)[C@@H]1NC(=O)[C@@H]2CCCN2C(=O)CNC(=O)[C@H](CCSC)NC(=O)[C@H](Cc2cnc[nH]2)NC(=O)[C@H](CSSC[C@H](NC(=O)[C@@H](NC(=O)[C@H](Cc2ccc3ccccc3c2)NC(=O)[C@@H](NC1=O)[C@@H](C)O)C(C)C)C(=O)N[C@@H](CCC(N)=O)C(=O)N1CCC[C@H]1C(=O)N[C@@H](CC(C)C)C(=O)N[C@@H](CCCNC(N)=N)C(=O)N(C)CC(=O)N[C@@H](CCCCN)C(N)=O)NC(=O)[C@H](C)NC(=O)[C@H](Cc1ccc(O)cc1)NC(=O)[C@H](CC(C)C)NC(=O)CNC(=O)CNC(C)=O
: