Target
Epidermal growth factor receptor
Ligand
BDBM5446
Substrate
Meas. Tech.
ChEMBL_1778842 (CHEMBL4235834)
IC50
1.2±n/a nM
Citation
 Devambatla, RKVChoudhary, SIhnat, MHamel, EMooberry, SLGangjee, A Design, synthesis and preclinical evaluation of 5-methyl-N Bioorg Med Chem Lett 28:3085-3093 (2018)  
Target
Name:
Epidermal growth factor receptor
Synonyms:
EGF Receptor Substrate EGFR_HUMAN ERBB1 Epidermal Growth Factor Receptor erbB-1 Epidermal growth factor receptor (EGFR) HER1 Proto-oncogene c-ErbB-1 Tyrosine-Protein Kinase ErbB-1
Type:
Receptor Kinase Domain
Mol. Mass.:
134279.59
Organism:
Homo sapiens (Human)
Description:
P00533
Residue:
1210
  
Inhibitor
Name:
BDBM5446
Synonyms:
CHEMBL553 Erlotinib N-(3-Ethynylphenyl)-6,7-bis(2-methoxyethoxy)-4-quinazolinamine Monohydrochloride OSI-774 US10189853, erlotinib US11524945, Compound Erlotinib US9730934, Erlotinib cid_176870
Type:
Small organic molecule
Emp. Form.:
C22H23N3O4
Mol. Mass.:
393.4357
SMILES:
COCCOc1cc2ncnc(Nc3cccc(c3)C#C)c2cc1OCCOC
: