Target
Tyrosine-protein kinase BTK
Ligand
BDBM50463723
Substrate
Meas. Tech.
ChEMBL_1779260 (CHEMBL4236252)
IC50
4.1±n/a nM
Citation
 Qiu, HLiu-Bujalski, LCaldwell, RDFollis, AVGardberg, AGoutopoulos, AGrenningloh, RHead, JJohnson, TJones, RMochalkin, IMorandi, FNeagu, CSherer, B Discovery of potent, highly selective covalent irreversible BTK inhibitors from a fragment hit. Bioorg Med Chem Lett 28:2939-2944 (2018)  
Target
Name:
Tyrosine-protein kinase BTK
Synonyms:
AGMX1 Agammaglobulinaemia tyrosine kinase B cell progenitor kinase BPK BTK_HUMAN Tyrosine Kinase BTK Tyrosine-protein kinase BTK (BTK)
Type:
Enzyme
Mol. Mass.:
76289.95
Organism:
Homo sapiens (Human)
Description:
Q06187
Residue:
659
  
Inhibitor
Name:
BDBM50463723
Synonyms:
CHEMBL4250200
Type:
Small organic molecule
Emp. Form.:
C25H24N4O4
Mol. Mass.:
444.4825
SMILES:
NC(=O)c1ccc(nc1Oc1ccc(Oc2ccccc2)cc1)N1CCN(CC1)C(=O)C=C
: