Target
Aromatase
Ligand
BDBM50015985
Substrate
Meas. Tech.
ChEMBL_50721 (CHEMBL666800)
IC50
45000±n/a nM
Citation
 Leung, CSRowlands, MGJarman, MFoster, ABGriggs, LJWilman, DE Analogues of 3-ethyl-3-(4-pyridyl)piperidine-2,6-dione as selective inhibitors of aromatase: derivatives with variable 1-alkyl and 3-alkyl substituents. J Med Chem 30:1550-4 (1987)  
Target
Name:
Aromatase
Synonyms:
ARO1 CP19A_HUMAN CYP19 CYPXIX Cytochrome P450 19A1 Cytochrome P450-C19 (CYP19) FL cytokine receptor precursor | P-450AROM
Type:
Enzyme
Mol. Mass.:
57888.92
Organism:
Homo sapiens (Human)
Description:
P11511
Residue:
503
  
Inhibitor
Name:
BDBM50015985
Synonyms:
3-Ethyl-4,5-dihydro-3H-[3,4']bipyridinyl-2,6-dione Rogletimide
Type:
Small organic molecule
Emp. Form.:
C12H14N2O2
Mol. Mass.:
218.2518
SMILES:
CCC1(CCC(=O)NC1=O)c1ccncc1
: