Target
Transient receptor potential cation channel subfamily M member 8
Ligand
BDBM50463844
Substrate
Meas. Tech.
ChEMBL_1779572 (CHEMBL4236564)
IC50
6.0±n/a nM
Citation
 Horne, DBBiswas, KBrown, JBartberger, MDClarine, JDavis, CDGore, VKHarried, SHorner, MKaller, MRLehto, SGLiu, QMa, VVMonenschein, HNguyen, TTYuan, CCYoungblood, BDZhang, MZhong, WAllen, JRChen, JJGavva, NR Discovery of TRPM8 Antagonist ( S)-6-(((3-Fluoro-4-(trifluoromethoxy)phenyl)(3-fluoropyridin-2-yl)methyl)carbamoyl)nicotinic Acid (AMG 333), a Clinical Candidate for the Treatment of Migraine. J Med Chem 61:8186-8201 (2018)  
Target
Name:
Transient receptor potential cation channel subfamily M member 8
Synonyms:
LTrpC-6 Ltrpc6 Transient receptor potential p8 Trpm8 | Trpp8
Type:
PROTEIN
Mol. Mass.:
127713.99
Organism:
Mus musculus
Description:
ChEMBL_107992
Residue:
1104
  
Inhibitor
Name:
BDBM50463844
Synonyms:
CHEMBL4247840
Type:
Small organic molecule
Emp. Form.:
C21H14F6N2O2
Mol. Mass.:
440.3385
SMILES:
Oc1ccc(cc1)C(=O)N[C@@H](c1ccc(cc1)C(F)(F)F)c1ncccc1C(F)(F)F
: