Target
Transient receptor potential cation channel subfamily M member 8
Ligand
BDBM50463869
Substrate
Meas. Tech.
ChEMBL_1779572 (CHEMBL4236564)
IC50
212±n/a nM
Citation
 Horne, DBBiswas, KBrown, JBartberger, MDClarine, JDavis, CDGore, VKHarried, SHorner, MKaller, MRLehto, SGLiu, QMa, VVMonenschein, HNguyen, TTYuan, CCYoungblood, BDZhang, MZhong, WAllen, JRChen, JJGavva, NR Discovery of TRPM8 Antagonist ( S)-6-(((3-Fluoro-4-(trifluoromethoxy)phenyl)(3-fluoropyridin-2-yl)methyl)carbamoyl)nicotinic Acid (AMG 333), a Clinical Candidate for the Treatment of Migraine. J Med Chem 61:8186-8201 (2018)  
Target
Name:
Transient receptor potential cation channel subfamily M member 8
Synonyms:
LTrpC-6 Ltrpc6 Transient receptor potential p8 Trpm8 | Trpp8
Type:
PROTEIN
Mol. Mass.:
127713.99
Organism:
Mus musculus
Description:
ChEMBL_107992
Residue:
1104
  
Inhibitor
Name:
BDBM50463869
Synonyms:
CHEMBL4237383
Type:
Small organic molecule
Emp. Form.:
C25H15F7N2O
Mol. Mass.:
492.3882
SMILES:
Fc1cc(ccc1C(F)(F)F)[C@H](NC(=O)c1ccc2cccnc2c1)c1ccccc1C(F)(F)F
: