Target
3-hydroxy-3-methylglutaryl-coenzyme A reductase
Ligand
BDBM50024637
Substrate
Meas. Tech.
ChEBML_80654
IC50
2.7±n/a nM
Citation
 Hoffman, WFAlberts, AWAnderson, PSChen, JSSmith, RLWillard, AK 3-Hydroxy-3-methylglutaryl-coenzyme A reductase inhibitors. 4. Side chain ester derivatives of mevinolin. J Med Chem 29:849-52 (1986)  
Target
Name:
3-hydroxy-3-methylglutaryl-coenzyme A reductase
Synonyms:
HMDH_RAT Hmgcr
Type:
Enzyme
Mol. Mass.:
96689.85
Organism:
Rattus norvegicus (rat)
Description:
Isolated rat liver microsomes were used as enzyme source.
Residue:
887
  
Inhibitor
Name:
BDBM50024637
Synonyms:
2,2-Diethyl-butyric acid 8-[2-(4-hydroxy-6-oxo-tetrahydro-pyran-2-yl)-ethyl]-3,7-dimethyl-1,2,3,7,8,8a-hexahydro-naphthalen-1-yl ester | CHEMBL3349950
Type:
Small organic molecule
Emp. Form.:
C24H36O5
Mol. Mass.:
404.5396
SMILES:
C[C@@H]1C[C@H](OC(=O)C(C)(C)C)C2[C@@H](CC[C@@H]3C[C@@H](O)CC(=O)O3)[C@@H](C)C=CC2=C1
: