Target
Integrin alpha-V/beta-6
Ligand
BDBM50464108
Substrate
Meas. Tech.
ChEMBL_1779912 (CHEMBL4236904)
Ki
0.039811±n/a nM
Citation
 Procopiou, PAAnderson, NABarrett, JBarrett, TNCrawford, MHJFallon, BJHancock, APLe, JLemma, SMarshall, RPMorrell, JPritchard, JMRowedder, JESaklatvala, PSlack, RJSollis, SLSuckling, CJThorp, LRVitulli, GMacdonald, SJF Discovery of ( S)-3-(3-(3,5-Dimethyl-1 H-pyrazol-1-yl)phenyl)-4-(( R)-3-(2-(5,6,7,8-tetrahydro-1,8-naphthyridin-2-yl)ethyl)pyrrolidin-1-yl)butanoic Acid, a Nonpeptidic ? J Med Chem 61:8417-8443 (2018)  
Target
Name:
Integrin alpha-V/beta-6
Synonyms:
ITGAV/ITGB6 Integrin alpha-v/beata-6 Integrin beta-6/Vitronectin receptor alpha
Type:
Enzyme
Mol. Mass.:
Description:
Components:
This complex has 2 components.
Component 1
Name:
Integrin alpha-V
Synonyms:
ITAV_HUMAN Integrin alpha-V/alpha-5 VNRA Vitronectin receptor | Vitronectin receptor subunit alpha
Type:
PROTEIN
Mol. Mass.:
116024.92
Organism:
Homo sapiens (Human)
Description:
ChEMBL_582336
Residue:
1048
  
Component 2
Name:
Integrin beta-6
Synonyms:
ITB6_HUMAN | ITGB6
Type:
PROTEIN
Mol. Mass.:
85919.61
Organism:
Homo sapiens (Human)
Description:
EBI_10916
Residue:
788
  
Inhibitor
Name:
BDBM50464108
Synonyms:
CHEMBL4241824
Type:
Small organic molecule
Emp. Form.:
C29H37N5O2
Mol. Mass.:
487.6364
SMILES:
Cc1cc(C)n(n1)-c1cccc(c1)[C@@H](CN1CC[C@@H](CCc2ccc3CCCNc3n2)C1)CC(O)=O
: