Target
Protein kinase C zeta type
Ligand
BDBM50241867
Substrate
Meas. Tech.
ChEMBL_505888 (CHEMBL948567)
IC50
21000±n/a nM
Citation
 Herbert, JMMaffrand, JPTaoubi, KAugereau, JMFouraste, IGleye, J Verbascoside isolated from Lantana camara, an inhibitor of protein kinase C. J Nat Prod 54:1595-600 
Target
Name:
Protein kinase C zeta type
Synonyms:
KPCZ_RAT Prkcz Protein kinase C zeta type | nPKC-zeta
Type:
PROTEIN
Mol. Mass.:
67722.31
Organism:
Rattus norvegicus
Description:
ChEMBL_104731
Residue:
592
  
Inhibitor
Name:
BDBM50241867
Synonyms:
((2R,3R,4R,5R,6R)-6-(3,4-dihydroxyphenethoxy)-5-hydroxy-2-(hydroxymethyl)-4-((2S,3R,4R,5R,6S)-3,4,5-trihydroxy-6-methyltetrahydro-2H-pyran-2-yloxy)tetrahydro-2H-pyran-3-yl) 3-(3,4-dihydroxyphenyl)acrylate ACETOSIDE cid_24978601 verbacoside | verbascoside
Type:
Small organic molecule
Emp. Form.:
C29H36O15
Mol. Mass.:
624.5871
SMILES:
C[C@@H]1O[C@@H](O[C@@H]2[C@@H](O)[C@H](OCCc3ccc(O)c(O)c3)O[C@H](CO)[C@H]2OC(=O)\C=C\c2ccc(O)c(O)c2)[C@H](O)[C@H](O)[C@H]1O
: