Target
Cytochrome P450 11B1, mitochondrial
Ligand
BDBM50028166
Substrate
Meas. Tech.
ChEMBL_1781510 (CHEMBL4253027)
IC50
15±n/a nM
Citation
 Emmerich, Jvan Koppen, CJBurkhart, JLEngeli, RTHu, QOdermatt, AHartmann, RW Accelerated skin wound healing by selective 11?-Hydroxylase (CYP11B1) inhibitors. Eur J Med Chem 143:591-597 (2018)  
Target
Name:
Cytochrome P450 11B1, mitochondrial
Synonyms:
C11B1_HUMAN CYPXIB1 Cytochrome P450 11B1 Cytochrome P450 11B1, mitochondrial | S11BH
Type:
Enzyme
Mol. Mass.:
57591.44
Organism:
Homo sapiens (Human)
Description:
P15538
Residue:
503
  
Inhibitor
Name:
BDBM50028166
Synonyms:
CHEMBL934 US9138393, Metyrapone US9394290, MTP (metyrapone)
Type:
Small organic molecule
Emp. Form.:
C14H14N2O
Mol. Mass.:
226.2738
SMILES:
CC(C)(C(=O)c1cccnc1)c1cccnc1
: