Target
Low molecular weight protein-tyrosine phosphatase A
Ligand
BDBM50108046
Substrate
Meas. Tech.
ChEMBL_1782400 (CHEMBL4253917)
IC50
67230±n/a nM
Citation
 Mascarello, AOrbem Menegatti, ACCalcaterra, AMartins, PGAChiaradia-Delatorre, LDD'Acquarica, IFerrari, FPau, VSanna, ADe Logu, ABotta, MBotta, BTerenzi, HMori, M Naturally occurring Diels-Alder-type adducts from Morus nigra as potent inhibitors of Mycobacterium tuberculosis protein tyrosine phosphatase B. Eur J Med Chem 144:277-288 (2018)  
Target
Name:
Low molecular weight protein-tyrosine phosphatase A
Synonyms:
PTPA_MYCTU Probable low molecular weight protein-tyrosine-phosphatase mptpA | ptpA
Type:
Hydrolase
Mol. Mass.:
17891.84
Organism:
Mycobacterium tuberculosis
Description:
Residue:
163
  
Inhibitor
Name:
BDBM50108046
Synonyms:
(oxyresveratrol)4-[(E)-2-(3,5-dihydroxyphenyl)vinyl]benzene-1,3-diol OXYRESVERATROL trans-2,4,3',5'-tetrahydroxystilbene
Type:
Small organic molecule
Emp. Form.:
C14H12O4
Mol. Mass.:
244.2427
SMILES:
Oc1ccc(\C=C\c2cc(O)cc(O)c2)c(O)c1
: