Target
Histone deacetylase 6
Ligand
BDBM50464793
Substrate
Meas. Tech.
ChEMBL_1782646 (CHEMBL4254163)
IC50
0.930000±n/a nM
Citation
 Ling, YGuo, JYang, QZhu, PMiao, JGao, WPeng, YYang, JXu, KXiong, BLiu, GTao, JLuo, LZhu, QZhang, Y Development of novel ?-carboline-based hydroxamate derivatives as HDAC inhibitors with antiproliferative and antimetastatic activities in human cancer cells. Eur J Med Chem 144:398-409 (2018)  
Target
Name:
Histone deacetylase 6
Synonyms:
Cereblon/Histone deacetylase 6 HDAC6 Histone deacetylase 6 (HDAC6) KIAA0901 | ORF Names:JM21
Type:
Chromatin regulator; hydrolase; repressor
Mol. Mass.:
131381.51
Organism:
Homo sapiens (Human)
Description:
Q9UBN7
Residue:
1215
  
Inhibitor
Name:
BDBM50464793
Synonyms:
CHEMBL4278715
Type:
Small organic molecule
Emp. Form.:
C28H26N4O5
Mol. Mass.:
498.5298
SMILES:
COc1cc(cc(OC)c1OC)-c1nc(NCc2ccc(cc2)C(=O)NO)cc2c3ccccc3[nH]c12
: