Target
Dihydrofolate reductase
Ligand
BDBM50405399
Substrate
Meas. Tech.
ChEMBL_53612 (CHEMBL661842)
IC50
20±n/a nM
Citation
 DeGraw, JIChristie, PHTagawa, HKisliuk, RLGaumont, YSchmid, FASirotnak, FM Synthesis and biological activity of resolved C-10 diastereomers of 10-methyl- and 10-ethyl-10-deazaminopterin. J Med Chem 29:1056-61 (1986)  
Target
Name:
Dihydrofolate reductase
Synonyms:
1.5.1.3 DYR_CHICK
Type:
Mol. Mass.:
21652.69
Organism:
Gallus gallus (Chicken)
Description:
Residue:
189
  
Inhibitor
Name:
BDBM50405399
Synonyms:
CHEMBL2051989
Type:
Small organic molecule
Emp. Form.:
C22H29N7O5
Mol. Mass.:
471.5096
SMILES:
CC[C@H](CC1CNc2nc(N)nc(N)c2N1)c1ccc(cc1)C(=O)N[C@@H](CCC(O)=O)C(O)=O
: