Target
4,4'-diapophytoene desaturase (4,4'-diaponeurosporene-forming)
Ligand
BDBM50465159
Substrate
Meas. Tech.
ChEMBL_1784289 (CHEMBL4255806)
IC50
1.1±n/a nM
Citation
 Ni, SLi, BChen, FWei, HMao, FLiu, YXu, YQiu, XLi, XLiu, WHu, LLing, DWang, MZheng, XZhu, JLan, LLi, J Novel Staphyloxanthin Inhibitors with Improved Potency against Multidrug Resistant  ACS Med Chem Lett 9:233-237 (2018)  
Target
Name:
4,4'-diapophytoene desaturase (4,4'-diaponeurosporene-forming)
Synonyms:
4,4'-diapophytoene desaturase Dehydrosqualene desaturase crtN
Type:
PROTEIN
Mol. Mass.:
56731.85
Organism:
Staphylococcus aureus (strain Newman)
Description:
ChEMBL_116799
Residue:
502
  
Inhibitor
Name:
BDBM50465159
Synonyms:
CHEMBL4278050
Type:
Small organic molecule
Emp. Form.:
C20H21ClF3NO2
Mol. Mass.:
399.834
SMILES:
Cl.CN(C\C=C\c1ccc(cc1)C(F)(F)F)Cc1ccc2OCCOc2c1
: