Target
Neuronal acetylcholine receptor subunit alpha-4/beta-2
Ligand
BDBM50465456
Substrate
Meas. Tech.
ChEMBL_1785018 (CHEMBL4256535)
EC50
3.1±n/a nM
Citation
 Fitch, RWSnider, BBZhou, QFoxman, BMPandya, AAYakel, JLOlson, TTAl-Muhtasib, NXiao, YWelch, KDPanter, KE Absolute Configuration and Pharmacology of the Poison Frog Alkaloid Phantasmidine. J Nat Prod 81:1029-1035 (2018)  
Target
Name:
Neuronal acetylcholine receptor subunit alpha-4/beta-2
Synonyms:
Neuronal acetylcholine receptor alpha4/beta2 Neuronal acetylcholine receptor; alpha4/beta2
Type:
Mol. Mass.:
Description:
Components:
This complex has 0 components.
Component 1
Name:
Neuronal acetylcholine receptor subunit alpha-4
Synonyms:
ACHA4_RAT Cholinergic, Nicotinic Alpha4Beta2 Chrna4 Neuronal acetylcholine receptor (alpha4beta2 nAChR) Neuronal acetylcholine receptor subunit alpha 4 beta 2 | Neuronal acetylcholine receptor subunit alpha-4
Type:
Enzyme
Mol. Mass.:
70196.44
Organism:
Rattus norvegicus (Rat)
Description:
P09483
Residue:
630
  
Component 2
Name:
Neuronal acetylcholine receptor subunit beta-2
Synonyms:
ACHB2_RAT Chrnb2 Neuronal acetylcholine receptor non-alpha-1 chain
Type:
Enzyme
Mol. Mass.:
56910.32
Organism:
Rattus norvegicus (Rat)
Description:
P12390
Residue:
500
  
Inhibitor
Name:
BDBM50465456
Synonyms:
CHEMBL4283703
Type:
Small organic molecule
Emp. Form.:
C11H11ClN2O
Mol. Mass.:
222.671
SMILES:
Clc1ccc2C3CNC4CCC34Oc2n1
: