Target
Dual specificity protein kinase TTK
Ligand
BDBM50341532
Substrate
Meas. Tech.
ChEMBL_1785124 (CHEMBL4256641)
Ki
5400±n/a nM
Citation
 Fearon, DWestwood, IMvan Montfort, RLMBayliss, RJones, KBavetsias, V Synthesis and profiling of a 3-aminopyridin-2-one-based kinase targeted fragment library: Identification of 3-amino-5-(pyridin-4-yl)pyridin-2(1H)-one scaffold for monopolar spindle 1 (MPS1) and Aurora kinases inhibition. Bioorg Med Chem 26:3021-3029 (2018)  
Target
Name:
Dual specificity protein kinase TTK
Synonyms:
Dual specificity protein kinase (TTK) MPS1 Monopolar Spindle 1 (MPS1) Monopolar Spindle 1 Kinase (MPS1) TTK | TTK_HUMAN
Type:
Protein
Mol. Mass.:
97086.79
Organism:
Homo sapiens (Human)
Description:
P33981
Residue:
857
  
Inhibitor
Name:
BDBM50341532
Synonyms:
3-Benzoylamino-5-(pyridin-4-yl)-(1H)-pyridin-2-one N-(6-oxo-1,6-dihydro-3,4'-bipyridin-5-yl)benzamide
Type:
Small organic molecule
Emp. Form.:
C17H13N3O2
Mol. Mass.:
291.304
SMILES:
O=C(Nc1cc(c[nH]c1=O)-c1ccncc1)c1ccccc1
: