Target
Multidrug resistance-associated protein 1
Ligand
BDBM50465859
Substrate
Meas. Tech.
ChEMBL_1788926 (CHEMBL4260660)
EC50
263±n/a nM
Citation
 Wong, ILKZhu, XChan, KFLaw, MCLo, AMYHu, XChow, LMCChan, TH Discovery of Novel Flavonoid Dimers To Reverse Multidrug Resistance Protein 1 (MRP1, ABCC1) Mediated Drug Resistance in Cancers Using a High Throughput Platform with "Click Chemistry". J Med Chem 61:9931-9951 (2018)  
Target
Name:
Multidrug resistance-associated protein 1
Synonyms:
7.6.2.2 ABCC1 ATP-binding cassette, sub-family C, member 1 isoform 1 LTC4 transporter MRP MRP1_HUMAN
Type:
Mol. Mass.:
171597.72
Organism:
Homo sapiens (Human)
Description:
P33527
Residue:
1531
  
Inhibitor
Name:
BDBM50465859
Synonyms:
CHEMBL4286699
Type:
Small organic molecule
Emp. Form.:
C39H33N3O8
Mol. Mass.:
671.6946
SMILES:
O=c1cc(oc2ccccc12)-c1ccc(OCCOCCn2cc(COCCOc3ccc4c(c3)oc(cc4=O)-c3ccccc3)nn2)cc1
: