Target
BMP-2-inducible protein kinase
Ligand
BDBM412675
Substrate
Meas. Tech.
ChEMBL_1789549 (CHEMBL4261283)
Kd
7.5±n/a nM
Citation
 Elsayed, MSANielsen, JJPark, SPark, JLiu, QKim, CHPommier, YAgama, KLow, PSCushman, M Application of Sequential Palladium Catalysis for the Discovery of Janus Kinase Inhibitors in the Benzo[ c]pyrrolo[2,3- h][1,6]naphthyridin-5-one (BPN) Series. J Med Chem 61:10440-10462 (2018)  
Target
Name:
BMP-2-inducible protein kinase
Synonyms:
BIKE BMP2K | BMP2K_HUMAN
Type:
PROTEIN
Mol. Mass.:
129169.50
Organism:
Homo sapiens (Human)
Description:
ChEMBL_774589
Residue:
1161
  
Inhibitor
Name:
BDBM412675
Synonyms:
US10399979, Compound 17b
Type:
Small organic molecule
Emp. Form.:
C23H25N3O3
Mol. Mass.:
391.4629
SMILES:
COc1cc2c3cnc4[nH]ccc4c3n(CC3CCCCC3)c(=O)c2cc1OC
: