Target
17-beta-hydroxysteroid dehydrogenase type 2
Ligand
BDBM50466023
Substrate
Meas. Tech.
ChEMBL_1789612 (CHEMBL4261346)
IC50
6.0±n/a nM
Citation
 Siebenbuerger, LHernandez-Olmos, VAbdelsamie, ASFrotscher, Mvan Koppen, CJMarchais-Oberwinkler, SScheuer, CLaschke, MWMenger, MDBoerger, CHartmann, RW Highly Potent 17?-HSD2 Inhibitors with a Promising Pharmacokinetic Profile for Targeted Osteoporosis Therapy. J Med Chem 61:10724-10738 (2018)  
Target
Name:
17-beta-hydroxysteroid dehydrogenase type 2
Synonyms:
17-beta-Hydroxysteroid Dehydrogenase 2 (17-beta-HSD2) 20-alpha-HSD EDH17B2 Estradiol 17-beta-dehydrogenase 2 (17beta-HSD2) Microsomal 17-beta-hydroxysteroid dehydrogenas Testosterone 17-beta-dehydrogenase
Type:
Oxidoreductase; single-pass type II membrane protein
Mol. Mass.:
42795.29
Organism:
Homo sapiens (Human)
Description:
Enzyme was partially purified from human placenta.
Residue:
387
  
Inhibitor
Name:
BDBM50466023
Synonyms:
CHEMBL4292504
Type:
Small organic molecule
Emp. Form.:
C18H12F3NO2S
Mol. Mass.:
363.354
SMILES:
Cc1c(N)cccc1-c1ccc(s1)C(=O)c1cc(F)c(F)c(O)c1F
: