Target
Carnitine palmitoyl transferase I liver isoform
Ligand
BDBM50024433
Substrate
Meas. Tech.
ChEBML_44012
IC50
300±n/a nM
Citation
 Ho, WTutwiler, GFCottrell, SCMorgans, DJTarhan, OMohrbacher, RJ Alkylglycidic acids: potential new hypoglycemic agents. J Med Chem 29:2184-90 (1986)  
Target
Name:
Carnitine palmitoyl transferase I liver isoform
Synonyms:
Carnitine palmitoyltransferase 1A
Type:
PROTEIN
Mol. Mass.:
30247.29
Organism:
Sus scrofa
Description:
ChEMBL_44012
Residue:
263
  
Inhibitor
Name:
BDBM50024433
Synonyms:
(+/-) 2-Tetradecyl-oxirane-2-carboxylic acid methyl ester CHEMBL12261 | Methyl palmoxirate
Type:
Small organic molecule
Emp. Form.:
C18H34O3
Mol. Mass.:
298.4608
SMILES:
CCCCCCCCCCCCCCC1(CO1)C(=O)OC
: