Target
Carnitine palmitoyl transferase I liver isoform
Ligand
BDBM50024431
Substrate
Meas. Tech.
ChEBML_44012
IC50
900±n/a nM
Citation
 Ho, WTutwiler, GFCottrell, SCMorgans, DJTarhan, OMohrbacher, RJ Alkylglycidic acids: potential new hypoglycemic agents. J Med Chem 29:2184-90 (1986)  
Target
Name:
Carnitine palmitoyl transferase I liver isoform
Synonyms:
Carnitine palmitoyltransferase 1A
Type:
PROTEIN
Mol. Mass.:
30247.29
Organism:
Sus scrofa
Description:
ChEMBL_44012
Residue:
263
  
Inhibitor
Name:
BDBM50024431
Synonyms:
(+/-)2-Tetradecyl-oxirane-2-carboxylic acid CHEMBL12394
Type:
Small organic molecule
Emp. Form.:
C17H32O3
Mol. Mass.:
284.4342
SMILES:
CCCCCCCCCCCCCCC1(CO1)C(O)=O
: