Target
Mineralocorticoid receptor
Ligand
BDBM19214
Substrate
Meas. Tech.
ChEMBL_1791561 (CHEMBL4263480)
IC50
0.305000±n/a nM
Citation
 Sampathi Perera, KLIHanson, AMLindeman, SImhoff, ALu, XSem, DSDonaldson, WA Synthesis and evaluation of 4-cycloheptylphenols as selective Estrogen receptor-? agonists (SERBAs). Eur J Med Chem 157:791-804 (2018)  
Target
Name:
Mineralocorticoid receptor
Synonyms:
MCR MLR NR3C2 | Nuclear receptor subfamily 3 group C member 2
Type:
Enzyme
Mol. Mass.:
107076.42
Organism:
Homo sapiens (Human)
Description:
P08235
Residue:
984
  
Inhibitor
Name:
BDBM19214
Synonyms:
(1S,2R,10S,11S,14S,15R,17S)-17-hydroxy-14-(2-hydroxyacetyl)-2-methyl-5-oxotetracyclo[8.7.0.0^{2,7}.0^{11,15}]heptadec-6-ene-15-carbaldehyde US10188667, Aldosterone | [3H]Aldosterone
Type:
Steroid
Emp. Form.:
C21H28O5
Mol. Mass.:
360.444
SMILES:
[H][C@@]12CC[C@H](C(=O)CO)[C@]1(C[C@H](O)[C@@]1([H])[C@@]2([H])CCC2=CC(=O)CC[C@]12C)C=O
: