Target
Activin receptor type-1
Ligand
BDBM50262079
Substrate
Meas. Tech.
ChEMBL_1792072 (CHEMBL4263991)
EC50
14±n/a nM
Citation
 Jiang, JKHuang, XShamim, KPatel, PRLee, AWang, AQNguyen, KTawa, GCuny, GDYu, PBZheng, WXu, XSanderson, PHuang, W Discovery of 3-(4-sulfamoylnaphthyl)pyrazolo[1,5-a]pyrimidines as potent and selective ALK2 inhibitors. Bioorg Med Chem Lett 28:3356-3362 (2018)  
Target
Name:
Activin receptor type-1
Synonyms:
ACVR1_MOUSE ActR-I Acvr Acvrlk2 | Tgfb1
Type:
Protein
Mol. Mass.:
57231.35
Organism:
Mus musculus
Description:
Residue:
509
  
Inhibitor
Name:
BDBM50262079
Synonyms:
4-(6-(4-(piperazin-1-yl)phenyl)pyrazolo[1,5-a]pyrimidin-3-yl)quinoline CHEMBL513147 | LDN-193189
Type:
Small organic molecule
Emp. Form.:
C25H22N6
Mol. Mass.:
406.4824
SMILES:
C1CN(CCN1)c1ccc(cc1)-c1cnc2c(cnn2c1)-c1ccnc2ccccc12
: