Target
Neuronal acetylcholine receptor subunit alpha-7
Ligand
BDBM80642
Substrate
Meas. Tech.
ChEMBL_1793437 (CHEMBL4265356)
IC50
41±n/a nM
Citation
 Bavo, FPucci, SFasoli, FLammi, CMoretti, MMucchietto, VLattuada, DViani, PDe Palma, CBudriesi, RCorradini, IDowell, CMcIntosh, JMClementi, FBolchi, CGotti, CPallavicini, M Potent Antiglioblastoma Agents by Hybridizing the Onium-Alkyloxy-Stilbene Based Structures of an ?7-nAChR, ?9-nAChR Antagonist and of a Pro-Oxidant Mitocan. J Med Chem 61:10531-10544 (2018)  
Target
Name:
Neuronal acetylcholine receptor subunit alpha-7
Synonyms:
ACHA7_HUMAN Cholinergic, Nicotinic Alpha7 Neuronal acetylcholine receptor protein alpha-7 subunit Nicotinic acetylcholine receptor alpha-7 (alpha7 nAChR)
Type:
Mol. Mass.:
56448.33
Organism:
Homo sapiens (Human)
Description:
CHRNA7 (NACHRA7)
Residue:
502
  
Inhibitor
Name:
BDBM80642
Synonyms:
CHEMBL191491 MLS002172460 cid_6433339 triethyl-[2-[4-[(E)-2-phenylethenyl]phenoxy]ethyl]azanium;iodide | triethyl-[2-[4-[(E)-styryl]phenoxy]ethyl]ammonium;iodide
Type:
Small organic molecule
Emp. Form.:
C22H30NO
Mol. Mass.:
324.4792
SMILES:
CC[N+](CC)(CC)CCOc1ccc(\C=C\c2ccccc2)cc1
: