Target
Adenosine receptor A2a
Ligand
BDBM50025571
Substrate
Meas. Tech.
ChEBML_27755
Ki
700±n/a nM
Citation
 Daly, JWPadgett, WLShamim, MT Analogues of caffeine and theophylline: effect of structural alterations on affinity at adenosine receptors. J Med Chem 29:1305-8 (1987)  
Target
Name:
Adenosine receptor A2a
Synonyms:
AA2AR_CAVPO ADORA2A | Adenosine A2a receptor
Type:
Enzyme Catalytic Domain
Mol. Mass.:
44955.08
Organism:
GUINEA PIG
Description:
ADENOSINE A2 0 GUINEA PIG::P46616
Residue:
409
  
Inhibitor
Name:
BDBM50025571
Synonyms:
7-Allyl-1,3-dipropyl-3,7-dihydro-purine-2,6-dione | CHEMBL284860
Type:
Small organic molecule
Emp. Form.:
C14H20N4O2
Mol. Mass.:
276.3342
SMILES:
CCCn1c2ncn(CC=C)c2c(=O)n(CCC)c1=O
: