Target
Adenosine receptor A2a
Ligand
BDBM82021
Substrate
Meas. Tech.
ChEBML_27755
Ki
3300±n/a nM
Citation
 Daly, JWPadgett, WLShamim, MT Analogues of caffeine and theophylline: effect of structural alterations on affinity at adenosine receptors. J Med Chem 29:1305-8 (1987)  
Target
Name:
Adenosine receptor A2a
Synonyms:
AA2AR_CAVPO ADORA2A | Adenosine A2a receptor
Type:
Enzyme Catalytic Domain
Mol. Mass.:
44955.08
Organism:
GUINEA PIG
Description:
ADENOSINE A2 0 GUINEA PIG::P46616
Residue:
409
  
Inhibitor
Name:
BDBM82021
Synonyms:
1,3-Diethylxanthine CHEMBL416013 | NSC_101420
Type:
Small organic molecule
Emp. Form.:
C9H12N4O2
Mol. Mass.:
208.2172
SMILES:
CCn1c2nc[nH]c2c(=O)n(CC)c1=O
: