Target
DNA polymerase alpha catalytic subunit
Ligand
BDBM50025593
Substrate
Meas. Tech.
ChEBML_50805
Ki
14400±n/a nM
Citation
 Wright, GEDudycz, LWKazimierczuk, ZBrown, NCKhan, NN Synthesis, cell growth inhibition, and antitumor screening of 2-(p-n-butylanilino)purines and their nucleoside analogues. J Med Chem 30:109-16 (1987)  
Target
Name:
DNA polymerase alpha catalytic subunit
Synonyms:
DNA polymerase (alpha/delta/epsilon) DPOLA_HUMAN POLA1
Type:
PROTEIN
Mol. Mass.:
165895.25
Organism:
Homo sapiens (Human)
Description:
ChEMBL_1365493
Residue:
1462
  
Inhibitor
Name:
BDBM50025593
Synonyms:
CHEMBL16122 | N*2*-(4-Butyl-phenyl)-9H-purine-2,6-diamine
Type:
Small organic molecule
Emp. Form.:
C15H18N6
Mol. Mass.:
282.3436
SMILES:
CCCCc1ccc(Nc2nc(N)c3[nH]cnc3n2)cc1
: