Target
Dual specificity tyrosine-phosphorylation-regulated kinase 1A
Ligand
BDBM7533
Substrate
Meas. Tech.
ChEMBL_1794569 (CHEMBL4266686)
IC50
3100±n/a nM
Citation
 Jarhad, DBMashelkar, KKKim, HRNoh, MJeong, LS Dual-Specificity Tyrosine Phosphorylation-Regulated Kinase 1A (DYRK1A) Inhibitors as Potential Therapeutics. J Med Chem 61:9791-9810 (2018)  
Target
Name:
Dual specificity tyrosine-phosphorylation-regulated kinase 1A
Synonyms:
DYR1A_HUMAN DYRK1A Dual specificity YAK1-related kinase 1A (Dyrk1A) Dual-specificity tyrosine-phosphorylation regulated kinase 1A HP86 MNBH
Type:
Enzyme
Mol. Mass.:
85616.61
Organism:
Homo sapiens (Human)
Description:
Q13627
Residue:
763
  
Inhibitor
Name:
BDBM7533
Synonyms:
(2R)-2-[[6-(benzylamino)-9-isopropyl-purin-2-yl]amino]butan-1-ol (2R)-2-[[6-[(phenylmethyl)amino]-9-propan-2-yl-2-purinyl]amino]-1-butanol (2R)-2-{[6-(benzylamino)-9-(propan-2-yl)-9H-purin-2-yl]amino}butan-1-ol 2,6,9-Trisubstituted purine deriv. 28 CYC-202 cid_160355
Type:
Small organic molecule
Emp. Form.:
C19H26N6O
Mol. Mass.:
354.4493
SMILES:
CC[C@H](CO)Nc1nc(NCc2ccccc2)c2ncn(C(C)C)c2n1
: