Target
Adenosine receptor A1
Ligand
BDBM50025679
Substrate
Meas. Tech.
ChEBML_29624
Ki
58±n/a nM
Citation
 Jacobson, KAUkena, DPadgett, WDaly, JWKirk, KL Xanthine functionalized congeners as potent ligands at A2-adenosine receptors. J Med Chem 30:211-4 (1987)  
Target
Name:
Adenosine receptor A1
Synonyms:
AA1R_RAT ADENOSINE A1 high Adenosine A1 receptor (A1) Adenosine receptors A1 | Adora1
Type:
Protein
Mol. Mass.:
36704.13
Organism:
Rattus norvegicus (rat)
Description:
Residue:
326
  
Inhibitor
Name:
BDBM50025679
Synonyms:
(4-{2-[4-(1,3-Diethyl-2,6-dioxo-2,3,6,7-tetrahydro-1H-purin-8-yl)-phenoxy]-acetylamino}-phenyl)-acetic acid methyl ester | CHEMBL67389
Type:
Small organic molecule
Emp. Form.:
C26H27N5O6
Mol. Mass.:
505.5225
SMILES:
CCn1c2nc([nH]c2c(=O)n(CC)c1=O)-c1ccc(OCC(=O)Nc2ccc(CC(=O)OC)cc2)cc1
: